{"text_format":"1","workbook":"xlsx","n_sheets":7,"sheets":["SCR","PivotESA","PivotGH","PivotGHRF","TDSSA_ALL","BasicMacroSCR","Sheet1"],"not_rendered":{"charts":0,"images":0,"macros":1,"external_links":0,"defined_names":3,"comments":0,"pivot_tables":0},"unopened":[],"bounds":{"document_bytes":16777216,"sheet_cells":100000,"rows_first":2000,"rows_last":500,"rows_between":2000,"halvings":0,"cell_chars":16384,"cell_head_chars":4096},"cells_cut":0,"cells_raw":0,"read":"whole","date_system":"1900"}

{"sheet":"SCR","index":0,"n_rows":0,"n_cols":0,"rows_kept":0,"cut":false,"hidden":false,"merged":[]}

{"sheet":"PivotESA","index":1,"n_rows":0,"n_cols":0,"rows_kept":0,"cut":false,"hidden":false,"merged":[]}

{"sheet":"PivotGH","index":2,"n_rows":0,"n_cols":0,"rows_kept":0,"cut":false,"hidden":false,"merged":[]}

{"sheet":"PivotGHRF","index":3,"n_rows":0,"n_cols":0,"rows_kept":0,"cut":false,"hidden":false,"merged":[]}

{"sheet":"TDSSA_ALL","index":4,"n_rows":965,"n_cols":18,"rows_kept":965,"cut":false,"hidden":false,"merged":[]}
[]
["Note:  In column H, M and R  "]
["Green:","Number of specific analyses above or equal to TDSSA requirement"]
["Yellow:","1 specific analysis less than TDSSA requirement "]
["Red:","Over 2 specific analyses less than TDSSA requirement "]
["SPORT","DISCIPLINE","Sport - Discipline as in SCR (ADAMS)","Total samples Urine\n(D)","ESAs MLA\n(E)","ESAs analyses required by TDSSA\n(F)\n","ESAs analyses conducted\n(G)\n","ESAs\nanalyses  difference with MLA\n(H)\n\n","Total samples urine\n(I)","GH MLA\n(J)","GH analyses required by TDSSA\n(K)","GH \nanalyses conducted\n(L)\n","GH analyses  difference with MLA\n(M)\n","Total samples Urine\n(N)","GHRFs MLA\n(O)","GHRFs analyses required by TDSSA\n(P)","GHRFs analyses conducted\n(Q)","GHRFs analyses  difference with MLA\n(R)"]
["Aikido","Aikido","Aikido - Aikido",{"$f":"IFERROR(VLOOKUP(C7,PivotGHRF!A:B,2,FALSE),\" \")","v":" "},0.05,{"$f":"IFERROR(ROUNDUP(E7*D7,0),0)","v":0},{"$f":"IFERROR(VLOOKUP(C7,PivotESA!A:C,3,FALSE),\" \")","v":" "},{"$f":"IFERROR(F7-G7,0)","v":0},{"$f":"IFERROR(VLOOKUP(C7,PivotGHRF!A:B,2,FALSE),\" \")","v":" "},0.05,{"$f":"IFERROR(ROUNDUP(J7*I7,0),0)","v":0},{"$f":"IFERROR(VLOOKUP(C7,PivotGH!A:C,3,FALSE),\" \")","v":" "},{"$f":"IFERROR(K7-L7,0)","v":0},{"$f":"IFERROR(VLOOKUP(C7,PivotGHRF!A:B,2,FALSE),\" \")","v":" "},0.05,{"$f":"IFERROR(ROUNDUP(O7*N7,0),0)","v":0},{"$f":"IFERROR(VLOOKUP(C7,PivotGHRF!A:C,3,FALSE),\" \")","v":" "},{"$f":"IFERROR(P7-Q7,0)","v":0}]
["Air Sports","Aerobatic","Air Sports - Aerobatic",{"$f":"IFERROR(VLOOKUP(C8,PivotGHRF!A:B,2,FALSE),\" \")","v":" "},0,{"$f":"IFERROR(ROUNDUP(E8*D8,0),0)","v":0},{"$f":"IFERROR(VLOOKUP(C8,PivotESA!A:C,3,FALSE),\" \")","v":" "},0,{"$f":"IFERROR(VLOOKUP(C8,PivotGHRF!A:B,2,FALSE),\" \")","v":" "},0,{"$f":"IFERROR(ROUNDUP(J8*I8,0),0)","v":0},{"$f":"IFERROR(VLOOKUP(C8,PivotGH!A:C,3,FALSE),\" \")","v":" "},0,{"$f":"IFERROR(VLOOKUP(C8,PivotGHRF!A:B,2,FALSE),\" \")","v":" "},0,{"$f":"IFERROR(ROUNDUP(O8*N8,0),0)","v":0},{"$f":"IFERROR(VLOOKUP(C8,PivotGHRF!A:C,3,FALSE),\" \")","v":" "},0]
["Air Sports","Ballooning","Air Sports - Ballooning",{"$f":"IFERROR(VLOOKUP(C9,PivotGHRF!A:B,2,FALSE),\" \")","v":" "},0,0,{"$f":"IFERROR(VLOOKUP(C9,PivotESA!A:C,3,FALSE),\" \")","v":" "},0,{"$f":"IFERROR(VLOOKUP(C9,PivotGHRF!A:B,2,FALSE),\" \")","v":" "},0,0,{"$f":"IFERROR(VLOOKUP(C9,PivotGH!A:C,3,FALSE),\" \")","v":" "},0,{"$f":"IFERROR(VLOOKUP(C9,PivotGHRF!A:B,2,FALSE),\" \")","v":" "},0,0,{"$f":"IFERROR(VLOOKUP(C9,PivotGHRF!A:C,3,FALSE),\" \")","v":" "},0]
["Air Sports","Parachuting","Air Sports - Parachuting",{"$f":"IFERROR(VLOOKUP(C10,PivotGHRF!A:B,2,FALSE),\" \")","v":" "},0,0,{"$f":"IFERROR(VLOOKUP(C10,PivotESA!A:C,3,FALSE),\" \")","v":" "},0,{"$f":"IFERROR(VLOOKUP(C10,PivotGHRF!A:B,2,FALSE),\" \")","v":" "},0,0,{"$f":"IFERROR(VLOOKUP(C10,PivotGH!A:C,3,FALSE),\" \")","v":" "},0,{"$f":"IFERROR(VLOOKUP(C10,PivotGHRF!A:B,2,FALSE),\" \")","v":" "},0,0,{"$f":"IFERROR(VLOOKUP(C10,PivotGHRF!A:C,3,FALSE),\" \")","v":" "},0]
["Air Sports","Aeromodeling","Air Sports - Aeromodeling",{"$f":"IFERROR(VLOOKUP(C11,PivotGHRF!A:B,2,FALSE),\" \")","v":" "},0,0,{"$f":"IFERROR(VLOOKUP(C11,PivotESA!A:C,3,FALSE),\" \")","v":" "},0,{"$f":"IFERROR(VLOOKUP(C11,PivotGHRF!A:B,2,FALSE),\" \")","v":" "},0,0,{"$f":"IFERROR(VLOOKUP(C11,PivotGH!A:C,3,FALSE),\" \")","v":" "},0,{"$f":"IFERROR(VLOOKUP(C11,PivotGHRF!A:B,2,FALSE),\" \")","v":" "},0,0,{"$f":"IFERROR(VLOOKUP(C11,PivotGHRF!A:C,3,FALSE),\" \")","v":" "},0]
["Air Sports","General Aviation","Air Sports - General Aviation",{"$f":"IFERROR(VLOOKUP(C12,PivotGHRF!A:B,2,FALSE),\" \")","v":" "},0,0,{"$f":"IFERROR(VLOOKUP(C12,PivotESA!A:C,3,FALSE),\" \")","v":" "},0,{"$f":"IFERROR(VLOOKUP(C12,PivotGHRF!A:B,2,FALSE),\" \")","v":" "},0,0,{"$f":"IFERROR(VLOOKUP(C12,PivotGH!A:C,3,FALSE),\" \")","v":" "},0,{"$f":"IFERROR(VLOOKUP(C12,PivotGHRF!A:B,2,FALSE),\" \")","v":" "},0,0,{"$f":"IFERROR(VLOOKUP(C12,PivotGHRF!A:C,3,FALSE),\" \")","v":" "},0]
["Air Sports","Hang Gliding & Paragliding","Air Sports - Hang Gliding & Paragliding",{"$f":"IFERROR(VLOOKUP(C13,PivotGHRF!A:B,2,FALSE),\" \")","v":" "},0,0,{"$f":"IFERROR(VLOOKUP(C13,PivotESA!A:C,3,FALSE),\" \")","v":" "},0,{"$f":"IFERROR(VLOOKUP(C13,PivotGHRF!A:B,2,FALSE),\" \")","v":" "},0,0,{"$f":"IFERROR(VLOOKUP(C13,PivotGH!A:C,3,FALSE),\" \")","v":" "},0,{"$f":"IFERROR(VLOOKUP(C13,PivotGHRF!A:B,2,FALSE),\" \")","v":" "},0,0,{"$f":"IFERROR(VLOOKUP(C13,PivotGHRF!A:C,3,FALSE),\" \")","v":" "},0]
["Air Sports","Microlight and Paramotor","Air Sports - Microlight and Paramotor",{"$f":"IFERROR(VLOOKUP(C14,PivotGHRF!A:B,2,FALSE),\" \")","v":" "},0,0,{"$f":"IFERROR(VLOOKUP(C14,PivotESA!A:C,3,FALSE),\" \")","v":" "},0,{"$f":"IFERROR(VLOOKUP(C14,PivotGHRF!A:B,2,FALSE),\" \")","v":" "},0,0,{"$f":"IFERROR(VLOOKUP(C14,PivotGH!A:C,3,FALSE),\" \")","v":" "},0,{"$f":"IFERROR(VLOOKUP(C14,PivotGHRF!A:B,2,FALSE),\" \")","v":" "},0,0,{"$f":"IFERROR(VLOOKUP(C14,PivotGHRF!A:C,3,FALSE),\" \")","v":" "},0]
["Air Sports","Gliding","Air Sports - Gliding",{"$f":"IFERROR(VLOOKUP(C15,PivotGHRF!A:B,2,FALSE),\" \")","v":" "},0,0,{"$f":"IFERROR(VLOOKUP(C15,PivotESA!A:C,3,FALSE),\" \")","v":" "},0,{"$f":"IFERROR(VLOOKUP(C15,PivotGHRF!A:B,2,FALSE),\" \")","v":" "},0,0,{"$f":"IFERROR(VLOOKUP(C15,PivotGH!A:C,3,FALSE),\" \")","v":" "},0,{"$f":"IFERROR(VLOOKUP(C15,PivotGHRF!A:B,2,FALSE),\" \")","v":" "},0,0,{"$f":"IFERROR(VLOOKUP(C15,PivotGHRF!A:C,3,FALSE),\" \")","v":" "},0]
["Air Sports","Rotorcraft","Air Sports - Rotorcraft",{"$f":"IFERROR(VLOOKUP(C16,PivotGHRF!A:B,2,FALSE),\" \")","v":" "},0,0,{"$f":"IFERROR(VLOOKUP(C16,PivotESA!A:C,3,FALSE),\" \")","v":" "},0,{"$f":"IFERROR(VLOOKUP(C16,PivotGHRF!A:B,2,FALSE),\" \")","v":" "},0,0,{"$f":"IFERROR(VLOOKUP(C16,PivotGH!A:C,3,FALSE),\" \")","v":" "},0,{"$f":"IFERROR(VLOOKUP(C16,PivotGHRF!A:B,2,FALSE),\" \")","v":" "},0,0,{"$f":"IFERROR(VLOOKUP(C16,PivotGHRF!A:C,3,FALSE),\" \")","v":" "},0]
["Air Sports","Military Parachuting","Air Sports - Military Parachuting",{"$f":"IFERROR(VLOOKUP(C17,PivotGHRF!A:B,2,FALSE),\" \")","v":" "},"Not in TDSSA",0,{"$f":"IFERROR(VLOOKUP(C17,PivotESA!A:C,3,FALSE),\" \")","v":" "},0,{"$f":"IFERROR(VLOOKUP(C17,PivotGHRF!A:B,2,FALSE),\" \")","v":" "},"Not in TDSSA",0,{"$f":"IFERROR(VLOOKUP(C17,PivotGH!A:C,3,FALSE),\" \")","v":" "},0,{"$f":"IFERROR(VLOOKUP(C17,PivotGHRF!A:B,2,FALSE),\" \")","v":" "},"Not in TDSSA",0,{"$f":"IFERROR(VLOOKUP(C17,PivotGHRF!A:C,3,FALSE),\" \")","v":" "},0]
["Air Sports","Powered Paragliding","Air Sports - Powered Paragliding",{"$f":"IFERROR(VLOOKUP(C18,PivotGHRF!A:B,2,FALSE),\" \")","v":" "},0,0,{"$f":"IFERROR(VLOOKUP(C18,PivotESA!A:C,3,FALSE),\" \")","v":" "},0,{"$f":"IFERROR(VLOOKUP(C18,PivotGHRF!A:B,2,FALSE),\" \")","v":" "},0,0,{"$f":"IFERROR(VLOOKUP(C18,PivotGH!A:C,3,FALSE),\" \")","v":" "},0,{"$f":"IFERROR(VLOOKUP(C18,PivotGHRF!A:B,2,FALSE),\" \")","v":" "},0,0,{"$f":"IFERROR(VLOOKUP(C18,PivotGHRF!A:C,3,FALSE),\" \")","v":" "},0]
["American Football","American Football","American Football - American Football",{"$f":"IFERROR(VLOOKUP(C19,PivotGHRF!A:B,2,FALSE),\" \")","v":" "},0.05,0,{"$f":"IFERROR(VLOOKUP(C19,PivotESA!A:C,3,FALSE),\" \")","v":" "},0,{"$f":"IFERROR(VLOOKUP(C19,PivotGHRF!A:B,2,FALSE),\" \")","v":" "},0.1,0,{"$f":"IFERROR(VLOOKUP(C19,PivotGH!A:C,3,FALSE),\" \")","v":" "},0,{"$f":"IFERROR(VLOOKUP(C19,PivotGHRF!A:B,2,FALSE),\" \")","v":" "},0.1,0,{"$f":"IFERROR(VLOOKUP(C19,PivotGHRF!A:C,3,FALSE),\" \")","v":" "},0]
["American Football","College","American Football - College",{"$f":"IFERROR(VLOOKUP(C20,PivotGHRF!A:B,2,FALSE),\" \")","v":" "},"Not in TDSSA",0,{"$f":"IFERROR(VLOOKUP(C20,PivotESA!A:C,3,FALSE),\" \")","v":" "},0,{"$f":"IFERROR(VLOOKUP(C20,PivotGHRF!A:B,2,FALSE),\" \")","v":" "},"Not in TDSSA",0,{"$f":"IFERROR(VLOOKUP(C20,PivotGH!A:C,3,FALSE),\" \")","v":" "},0,{"$f":"IFERROR(VLOOKUP(C20,PivotGHRF!A:B,2,FALSE),\" \")","v":" "},"Not in TDSSA",0,{"$f":"IFERROR(VLOOKUP(C20,PivotGHRF!A:C,3,FALSE),\" \")","v":" "},0]
["American Football","Beach Flag Football","American Football - Beach Flag Football",{"$f":"IFERROR(VLOOKUP(C21,PivotGHRF!A:B,2,FALSE),\" \")","v":" "},0.05,0,{"$f":"IFERROR(VLOOKUP(C21,PivotESA!A:C,3,FALSE),\" \")","v":" "},0,{"$f":"IFERROR(VLOOKUP(C21,PivotGHRF!A:B,2,FALSE),\" \")","v":" "},0.1,0,{"$f":"IFERROR(VLOOKUP(C21,PivotGH!A:C,3,FALSE),\" \")","v":" "},0,{"$f":"IFERROR(VLOOKUP(C21,PivotGHRF!A:B,2,FALSE),\" \")","v":" "},0.1,0,{"$f":"IFERROR(VLOOKUP(C21,PivotGHRF!A:C,3,FALSE),\" \")","v":" "},0]
["American Football","Football League","American Football - Football League",{"$f":"IFERROR(VLOOKUP(C22,PivotGHRF!A:B,2,FALSE),\" \")","v":" "},0.05,0,{"$f":"IFERROR(VLOOKUP(C22,PivotESA!A:C,3,FALSE),\" \")","v":" "},0,{"$f":"IFERROR(VLOOKUP(C22,PivotGHRF!A:B,2,FALSE),\" \")","v":" "},0.1,0,{"$f":"IFERROR(VLOOKUP(C22,PivotGH!A:C,3,FALSE),\" \")","v":" "},0,{"$f":"IFERROR(VLOOKUP(C22,PivotGHRF!A:B,2,FALSE),\" \")","v":" "},0.1,0,{"$f":"IFERROR(VLOOKUP(C22,PivotGHRF!A:C,3,FALSE),\" \")","v":" "},0]
["American Football","Junior","American Football - Junior",{"$f":"IFERROR(VLOOKUP(C23,PivotGHRF!A:B,2,FALSE),\" \")","v":" "},"Not in TDSSA",0,{"$f":"IFERROR(VLOOKUP(C23,PivotESA!A:C,3,FALSE),\" \")","v":" "},0,{"$f":"IFERROR(VLOOKUP(C23,PivotGHRF!A:B,2,FALSE),\" \")","v":" "},"Not in TDSSA",0,{"$f":"IFERROR(VLOOKUP(C23,PivotGH!A:C,3,FALSE),\" \")","v":" "},0,{"$f":"IFERROR(VLOOKUP(C23,PivotGHRF!A:B,2,FALSE),\" \")","v":" "},"Not in TDSSA",0,{"$f":"IFERROR(VLOOKUP(C23,PivotGHRF!A:C,3,FALSE),\" \")","v":" "},0]
["American Football","University","American Football - University",{"$f":"IFERROR(VLOOKUP(C24,PivotGHRF!A:B,2,FALSE),\" \")","v":" "},"Not in TDSSA",0,{"$f":"IFERROR(VLOOKUP(C24,PivotESA!A:C,3,FALSE),\" \")","v":" "},0,{"$f":"IFERROR(VLOOKUP(C24,PivotGHRF!A:B,2,FALSE),\" \")","v":" "},"Not in TDSSA",0,{"$f":"IFERROR(VLOOKUP(C24,PivotGH!A:C,3,FALSE),\" \")","v":" "},0,{"$f":"IFERROR(VLOOKUP(C24,PivotGHRF!A:B,2,FALSE),\" \")","v":" "},"Not in TDSSA",0,{"$f":"IFERROR(VLOOKUP(C24,PivotGHRF!A:C,3,FALSE),\" \")","v":" "},0]
["Aquatics","CISS Swimming","Aquatics - CISS Swimming",{"$f":"IFERROR(VLOOKUP(C25,PivotGHRF!A:B,2,FALSE),\" \")","v":" "},"Not in TDSSA",0,{"$f":"IFERROR(VLOOKUP(C25,PivotESA!A:C,3,FALSE),\" \")","v":" "},0,{"$f":"IFERROR(VLOOKUP(C25,PivotGHRF!A:B,2,FALSE),\" \")","v":" "},"Not in TDSSA",0,{"$f":"IFERROR(VLOOKUP(C25,PivotGH!A:C,3,FALSE),\" \")","v":" "},0,{"$f":"IFERROR(VLOOKUP(C25,PivotGHRF!A:B,2,FALSE),\" \")","v":" "},"Not in TDSSA",0,{"$f":"IFERROR(VLOOKUP(C25,PivotGHRF!A:C,3,FALSE),\" \")","v":" "},0]
["Aquatics","CISS Swimming Long Distance 800m and greater","Aquatics - CISS Swimming Long Distance 800m and greater",{"$f":"IFERROR(VLOOKUP(C26,PivotGHRF!A:B,2,FALSE),\" \")","v":" "},"Not in TDSSA",0,{"$f":"IFERROR(VLOOKUP(C26,PivotESA!A:C,3,FALSE),\" \")","v":" "},0,{"$f":"IFERROR(VLOOKUP(C26,PivotGHRF!A:B,2,FALSE),\" \")","v":" "},"Not in TDSSA",0,{"$f":"IFERROR(VLOOKUP(C26,PivotGH!A:C,3,FALSE),\" \")","v":" "},0,{"$f":"IFERROR(VLOOKUP(C26,PivotGHRF!A:B,2,FALSE),\" \")","v":" "},"Not in TDSSA",0,{"$f":"IFERROR(VLOOKUP(C26,PivotGHRF!A:C,3,FALSE),\" \")","v":" "},0]
["Aquatics","CISS Swimming Middle Distance 200-400m","Aquatics - CISS Swimming Middle Distance 200-400m",{"$f":"IFERROR(VLOOKUP(C27,PivotGHRF!A:B,2,FALSE),\" \")","v":" "},"Not in TDSSA",0,{"$f":"IFERROR(VLOOKUP(C27,PivotESA!A:C,3,FALSE),\" \")","v":" "},0,{"$f":"IFERROR(VLOOKUP(C27,PivotGHRF!A:B,2,FALSE),\" \")","v":" "},"Not in TDSSA",0,{"$f":"IFERROR(VLOOKUP(C27,PivotGH!A:C,3,FALSE),\" \")","v":" "},0,{"$f":"IFERROR(VLOOKUP(C27,PivotGHRF!A:B,2,FALSE),\" \")","v":" "},"Not in TDSSA",0,{"$f":"IFERROR(VLOOKUP(C27,PivotGHRF!A:C,3,FALSE),\" \")","v":" "},0]
["Aquatics","CISS Swimming Sprint 100m or less","Aquatics - CISS Swimming Sprint 100m or less",{"$f":"IFERROR(VLOOKUP(C28,PivotGHRF!A:B,2,FALSE),\" \")","v":" "},"Not in TDSSA",0,{"$f":"IFERROR(VLOOKUP(C28,PivotESA!A:C,3,FALSE),\" \")","v":" "},0,{"$f":"IFERROR(VLOOKUP(C28,PivotGHRF!A:B,2,FALSE),\" \")","v":" "},"Not in TDSSA",0,{"$f":"IFERROR(VLOOKUP(C28,PivotGH!A:C,3,FALSE),\" \")","v":" "},0,{"$f":"IFERROR(VLOOKUP(C28,PivotGHRF!A:B,2,FALSE),\" \")","v":" "},"Not in TDSSA",0,{"$f":"IFERROR(VLOOKUP(C28,PivotGHRF!A:C,3,FALSE),\" \")","v":" "},0]
["Aquatics","Free Diving","Aquatics - Free Diving",{"$f":"IFERROR(VLOOKUP(C29,PivotGHRF!A:B,2,FALSE),\" \")","v":" "},"Not in TDSSA",0,{"$f":"IFERROR(VLOOKUP(C29,PivotESA!A:C,3,FALSE),\" \")","v":" "},0,{"$f":"IFERROR(VLOOKUP(C29,PivotGHRF!A:B,2,FALSE),\" \")","v":" "},"Not in TDSSA",0,{"$f":"IFERROR(VLOOKUP(C29,PivotGH!A:C,3,FALSE),\" \")","v":" "},0,{"$f":"IFERROR(VLOOKUP(C29,PivotGHRF!A:B,2,FALSE),\" \")","v":" "},"Not in TDSSA",0,{"$f":"IFERROR(VLOOKUP(C29,PivotGHRF!A:C,3,FALSE),\" \")","v":" "},0]
["Aquatics","Diving","Aquatics - Diving",{"$f":"IFERROR(VLOOKUP(C30,PivotGHRF!A:B,2,FALSE),\" \")","v":" "},0,0,{"$f":"IFERROR(VLOOKUP(C30,PivotESA!A:C,3,FALSE),\" \")","v":" "},0,{"$f":"IFERROR(VLOOKUP(C30,PivotGHRF!A:B,2,FALSE),\" \")","v":" "},0.05,0,{"$f":"IFERROR(VLOOKUP(C30,PivotGH!A:C,3,FALSE),\" \")","v":" "},0,{"$f":"IFERROR(VLOOKUP(C30,PivotGHRF!A:B,2,FALSE),\" \")","v":" "},0.05,0,{"$f":"IFERROR(VLOOKUP(C30,PivotGHRF!A:C,3,FALSE),\" \")","v":" "},0]
["Aquatics","IBSA Swimming","Aquatics - IBSA Swimming",{"$f":"IFERROR(VLOOKUP(C31,PivotGHRF!A:B,2,FALSE),\" \")","v":" "},"Not in TDSSA",0,{"$f":"IFERROR(VLOOKUP(C31,PivotESA!A:C,3,FALSE),\" \")","v":" "},0,{"$f":"IFERROR(VLOOKUP(C31,PivotGHRF!A:B,2,FALSE),\" \")","v":" "},"Not in TDSSA",0,{"$f":"IFERROR(VLOOKUP(C31,PivotGH!A:C,3,FALSE),\" \")","v":" "},0,{"$f":"IFERROR(VLOOKUP(C31,PivotGHRF!A:B,2,FALSE),\" \")","v":" "},"Not in TDSSA",0,{"$f":"IFERROR(VLOOKUP(C31,PivotGHRF!A:C,3,FALSE),\" \")","v":" "},0]
["Aquatics","INAS Swimming","Aquatics - INAS Swimming",{"$f":"IFERROR(VLOOKUP(C32,PivotGHRF!A:B,2,FALSE),\" \")","v":" "},"Not in TDSSA",0,{"$f":"IFERROR(VLOOKUP(C32,PivotESA!A:C,3,FALSE),\" \")","v":" "},0,{"$f":"IFERROR(VLOOKUP(C32,PivotGHRF!A:B,2,FALSE),\" \")","v":" "},"Not in TDSSA",0,{"$f":"IFERROR(VLOOKUP(C32,PivotGH!A:C,3,FALSE),\" \")","v":" "},0,{"$f":"IFERROR(VLOOKUP(C32,PivotGHRF!A:B,2,FALSE),\" \")","v":" "},"Not in TDSSA",0,{"$f":"IFERROR(VLOOKUP(C32,PivotGHRF!A:C,3,FALSE),\" \")","v":" "},0]
["Aquatics","INAS Swimming Long Distance 800m and greater","Aquatics - INAS Swimming Long Distance 800m and greater",{"$f":"IFERROR(VLOOKUP(C33,PivotGHRF!A:B,2,FALSE),\" \")","v":" "},"Not in TDSSA",0,{"$f":"IFERROR(VLOOKUP(C33,PivotESA!A:C,3,FALSE),\" \")","v":" "},0,{"$f":"IFERROR(VLOOKUP(C33,PivotGHRF!A:B,2,FALSE),\" \")","v":" "},"Not in TDSSA",0,{"$f":"IFERROR(VLOOKUP(C33,PivotGH!A:C,3,FALSE),\" \")","v":" "},0,{"$f":"IFERROR(VLOOKUP(C33,PivotGHRF!A:B,2,FALSE),\" \")","v":" "},"Not in TDSSA",0,{"$f":"IFERROR(VLOOKUP(C33,PivotGHRF!A:C,3,FALSE),\" \")","v":" "},0]
["Aquatics","INAS Swimming Middle Distance 200-400m","Aquatics - INAS Swimming Middle Distance 200-400m",{"$f":"IFERROR(VLOOKUP(C34,PivotGHRF!A:B,2,FALSE),\" \")","v":" "},"Not in TDSSA",0,{"$f":"IFERROR(VLOOKUP(C34,PivotESA!A:C,3,FALSE),\" \")","v":" "},0,{"$f":"IFERROR(VLOOKUP(C34,PivotGHRF!A:B,2,FALSE),\" \")","v":" "},"Not in TDSSA",0,{"$f":"IFERROR(VLOOKUP(C34,PivotGH!A:C,3,FALSE),\" \")","v":" "},0,{"$f":"IFERROR(VLOOKUP(C34,PivotGHRF!A:B,2,FALSE),\" \")","v":" "},"Not in TDSSA",0,{"$f":"IFERROR(VLOOKUP(C34,PivotGHRF!A:C,3,FALSE),\" \")","v":" "},0]
["Aquatics","INAS Swimming Sprint 100m or less","Aquatics - INAS Swimming Sprint 100m or less",{"$f":"IFERROR(VLOOKUP(C35,PivotGHRF!A:B,2,FALSE),\" \")","v":" "},"Not in TDSSA",0,{"$f":"IFERROR(VLOOKUP(C35,PivotESA!A:C,3,FALSE),\" \")","v":" "},0,{"$f":"IFERROR(VLOOKUP(C35,PivotGHRF!A:B,2,FALSE),\" \")","v":" "},"Not in TDSSA",0,{"$f":"IFERROR(VLOOKUP(C35,PivotGH!A:C,3,FALSE),\" \")","v":" "},0,{"$f":"IFERROR(VLOOKUP(C35,PivotGHRF!A:B,2,FALSE),\" \")","v":" "},"Not in TDSSA",0,{"$f":"IFERROR(VLOOKUP(C35,PivotGHRF!A:C,3,FALSE),\" \")","v":" "},0]
["Aquatics","Military IPC Swimming Long Distance 800m and greater","Aquatics - Military IPC Swimming Long Distance 800m and greater",{"$f":"IFERROR(VLOOKUP(C36,PivotGHRF!A:B,2,FALSE),\" \")","v":" "},"Not in TDSSA",0,{"$f":"IFERROR(VLOOKUP(C36,PivotESA!A:C,3,FALSE),\" \")","v":" "},0,{"$f":"IFERROR(VLOOKUP(C36,PivotGHRF!A:B,2,FALSE),\" \")","v":" "},"Not in TDSSA",0,{"$f":"IFERROR(VLOOKUP(C36,PivotGH!A:C,3,FALSE),\" \")","v":" "},0,{"$f":"IFERROR(VLOOKUP(C36,PivotGHRF!A:B,2,FALSE),\" \")","v":" "},"Not in TDSSA",0,{"$f":"IFERROR(VLOOKUP(C36,PivotGHRF!A:C,3,FALSE),\" \")","v":" "},0]
["Aquatics","Military IPC Swimming","Aquatics - Military IPC Swimming",{"$f":"IFERROR(VLOOKUP(C37,PivotGHRF!A:B,2,FALSE),\" \")","v":" "},"Not in TDSSA",0,{"$f":"IFERROR(VLOOKUP(C37,PivotESA!A:C,3,FALSE),\" \")","v":" "},0,{"$f":"IFERROR(VLOOKUP(C37,PivotGHRF!A:B,2,FALSE),\" \")","v":" "},"Not in TDSSA",0,{"$f":"IFERROR(VLOOKUP(C37,PivotGH!A:C,3,FALSE),\" \")","v":" "},0,{"$f":"IFERROR(VLOOKUP(C37,PivotGHRF!A:B,2,FALSE),\" \")","v":" "},"Not in TDSSA",0,{"$f":"IFERROR(VLOOKUP(C37,PivotGHRF!A:C,3,FALSE),\" \")","v":" "},0]
["Aquatics","Military IPC Swimming Middle Distance 200-400m","Aquatics - Military IPC Swimming Middle Distance 200-400m",{"$f":"IFERROR(VLOOKUP(C38,PivotGHRF!A:B,2,FALSE),\" \")","v":" "},"Not in TDSSA",0,{"$f":"IFERROR(VLOOKUP(C38,PivotESA!A:C,3,FALSE),\" \")","v":" "},0,{"$f":"IFERROR(VLOOKUP(C38,PivotGHRF!A:B,2,FALSE),\" \")","v":" "},"Not in TDSSA",0,{"$f":"IFERROR(VLOOKUP(C38,PivotGH!A:C,3,FALSE),\" \")","v":" "},0,{"$f":"IFERROR(VLOOKUP(C38,PivotGHRF!A:B,2,FALSE),\" \")","v":" "},"Not in TDSSA",0,{"$f":"IFERROR(VLOOKUP(C38,PivotGHRF!A:C,3,FALSE),\" \")","v":" "},0]
["Aquatics","Military IPC Swimming 100m or less","Aquatics - Military IPC Swimming 100m or less",{"$f":"IFERROR(VLOOKUP(C39,PivotGHRF!A:B,2,FALSE),\" \")","v":" "},"Not in TDSSA",0,{"$f":"IFERROR(VLOOKUP(C39,PivotESA!A:C,3,FALSE),\" \")","v":" "},0,{"$f":"IFERROR(VLOOKUP(C39,PivotGHRF!A:B,2,FALSE),\" \")","v":" "},"Not in TDSSA",0,{"$f":"IFERROR(VLOOKUP(C39,PivotGH!A:C,3,FALSE),\" \")","v":" "},0,{"$f":"IFERROR(VLOOKUP(C39,PivotGHRF!A:B,2,FALSE),\" \")","v":" "},"Not in TDSSA",0,{"$f":"IFERROR(VLOOKUP(C39,PivotGHRF!A:C,3,FALSE),\" \")","v":" "},0]
["Aquatics","Military Swimming","Aquatics - Military Swimming",{"$f":"IFERROR(VLOOKUP(C40,PivotGHRF!A:B,2,FALSE),\" \")","v":" "},"Not in TDSSA",0,{"$f":"IFERROR(VLOOKUP(C40,PivotESA!A:C,3,FALSE),\" \")","v":" "},0,{"$f":"IFERROR(VLOOKUP(C40,PivotGHRF!A:B,2,FALSE),\" \")","v":" "},"Not in TDSSA",0,{"$f":"IFERROR(VLOOKUP(C40,PivotGH!A:C,3,FALSE),\" \")","v":" "},0,{"$f":"IFERROR(VLOOKUP(C40,PivotGHRF!A:B,2,FALSE),\" \")","v":" "},"Not in TDSSA",0,{"$f":"IFERROR(VLOOKUP(C40,PivotGHRF!A:C,3,FALSE),\" \")","v":" "},0]
{"$rows_left_out":926}
{"sheet":"BasicMacroSCR","index":5,"n_rows":2,"n_cols":46,"rows_kept":2,"cut":false,"hidden":false,"merged":[]}
[null,null,null,null,null,null,null,null,null,null,null,null,null,null,null,null,null,null,null,null,null,null,null,"ESAs (incl. recombinant EPOs and analogues)","GHRF (GHS/GHRP)","GHRF (GHRH)","ALL GHRF","GH Isoforms","GH Biomarkers","ALL GH","SAA 1 trimmed","SAA 2 trimmed","SAA 3 trimmed","SAA 4 trimmed","SAA 5 trimmed","SAA 6 trimmed","SAA 7 trimmed","SAA 8 trimmed","Lab Analysis Type","Specific Analysis 2","Specific Analysis 3","Specific Analysis 4","Specific Analysis 5","Specific Analysis 6","Specific Analysis 7","Specific Analysis 8"]
[null,null,null,null,null,null,null,null,null,null,null,null,null,null,null,null,null,null,null,null,null,null,null,{"$f":"COUNTIF($AE2:$AJ2,X$1)","v":0},{"$f":"COUNTIF($AE2:$AJ2,Y$1)","v":0},{"$f":"COUNTIF($AE2:$AJ2,Z$1)","v":0},{"$f":"IF(Y2+Z2=2,1,Y2+Z2)","v":0},{"$f":"COUNTIF($AE2:$AJ2,AB$1)","v":0},{"$f":"COUNTIF($AE2:$AJ2,AC$1)","v":0},{"$f":"IF(AC2+AB2=2,1,AC2+AB2)","v":0},{"$f":"TRIM(AM2)","v":""},{"$f":"TRIM(AN2)","v":""},"","","","","",""]

{"sheet":"Sheet1","index":6,"n_rows":0,"n_cols":0,"rows_kept":0,"cut":false,"hidden":false,"merged":[]}